Reaction Details
TargetProstaglandin E synthase
LigandBDBM50038649
Substrate/Competitorn/a
Meas. Tech.ChEMBL_571973 (CHEMBL1036476)
IC50 6700±n/a nM
Citation Liedtke, AJKeck, PRLehmann, FKoeberle, AWerz, OLaufer, SA Arylpyrrolizines as inhibitors of microsomal prostaglandin E2 synthase-1 (mPGES-1) or as dual inhibitors of mPGES-1 and 5-lipoxygenase (5-LOX). J Med Chem52:4968-72 (2009) 
 
Prostaglandin E synthase
Name:Prostaglandin E synthase
Type:Protein
Mol. Mass.:17112.22
Organism:Homo sapiens (Human)
Description:n/a
Residue:152
BDBM50038649
NameBDBM50038649
Synonyms:2-(6-(4-chlorophenyl)-2,2-dimethyl-7-phenyl-2,3-dihydro-1H-pyrrolizin-5-yl)acetic acid Licofelone [2-(4-Chloro-phenyl)-6,6-dimethyl-1-phenyl-6,7-dihydro-5H-pyrrolizin-3-yl]-acetic acid | [6-(4-CHLOROPHENYL)-2,2-DIMETHYL-7-PHENYL-2,3-DIHYDRO-1H-PYRROLIZIN-5-YL]ACETIC ACID
TypeSmall organic molecule
Emp. Form.C23H22ClNO2
Mol. Mass.379.879
SMILESCC1(C)Cc2c(c(c(CC(O)=O)n2C1)-c1ccc(Cl)cc1)-c1ccccc1