Reaction Details
TargetAdenosine receptor A3
LigandBDBM50294668
Substrate/Competitorn/a
Meas. Tech.ChEMBL_575807 (CHEMBL1024508)
Ki 13±n/a nM
Citation Pal, SChoi, WJChoe, SAHeller, CLGao, ZGChinn, MJacobson, KAHou, XLee, SKKim, HOJeong, LS Structure-activity relationships of truncated adenosine derivatives as highly potent and selective human A3 adenosine receptor antagonists. Bioorg Med Chem17:3733-8 (2009) 
 
Adenosine receptor A3
Name:Adenosine receptor A3
Type:G Protein-Coupled Receptor (GPCR)
Mol. Mass.:36197.32
Organism:Homo sapiens (Human)
Description:P0DMS8
Residue:318
BDBM50294668
NameBDBM50294668
Synonyms:(2R,3R,4R)-2-(2-Chloro-6-(3-bromobenzylamino)-9Hpurin-9-yl)-tetrahydrofuran-3,4-diol | CHEMBL561976
TypeSmall organic molecule
Emp. Form.C16H15BrClN5O3
Mol. Mass.440.679
SMILESO[C@@H]1CO[C@H]([C@@H]1O)n1cnc2c(NCc3cccc(Br)c3)nc(Cl)nc12