Reaction Details
TargetCytochrome P450 2C19
LigandBDBM50294708
Substrate/Competitorn/a
Meas. Tech.ChEMBL_576008 (CHEMBL1023634)
IC50 80±n/a nM
Citation Hammond, MPatterson, JRManns, SHoang, THWashburn, DGTrizna, WGlace, LGrygielko, ETNagilla, RNord, MFries, HEMinick, DJLaping, NJBray, JDThompson, SK Synthesis and SAR of amino acid-derived heterocyclic progesterone receptor full and partial agonists. Bioorg Med Chem Lett19:2637-41 (2009) 
 
Cytochrome P450 2C19
Name:Cytochrome P450 2C19
Type:Enzyme
Mol. Mass.:55935.47
Organism:Homo sapiens (Human)
Description:P33261
Residue:490
BDBM50294708
NameBDBM50294708
Synonyms:4-((2-chlorobenzyl)(1-(1-isopropyl-1H-tetrazol-5-yl)ethyl)amino)-2-chlorobenzonitrile | CHEMBL564015
TypeSmall organic molecule
Emp. Form.C20H20Cl2N6
Mol. Mass.415.319
SMILESCC(C)n1nnnc1C(C)N(Cc1ccccc1Cl)c1ccc(C#N)c(Cl)c1