Reaction Details
TargetProgesterone receptor
LigandBDBM50294701
Substrate/Competitorn/a
Meas. Tech.ChEMBL_575849 (CHEMBL1025356)
IC50 32±n/a nM
Citation Hammond, MPatterson, JRManns, SHoang, THWashburn, DGTrizna, WGlace, LGrygielko, ETNagilla, RNord, MFries, HEMinick, DJLaping, NJBray, JDThompson, SK Synthesis and SAR of amino acid-derived heterocyclic progesterone receptor full and partial agonists. Bioorg Med Chem Lett19:2637-41 (2009) 
 
Progesterone receptor
Name:Progesterone receptor
Type:Protein
Mol. Mass.:98979.52
Organism:Homo sapiens (Human)
Description:P06401
Residue:933
BDBM50294701
NameBDBM50294701
Synonyms:4-((2-chlorobenzyl)(1-(5-methyl-1,3,4-oxadiazol-2-yl)ethyl)amino)-2-chlorobenzonitrile | CHEMBL559581
TypeSmall organic molecule
Emp. Form.C19H16Cl2N4O
Mol. Mass.387.263
SMILESCC(N(Cc1ccccc1Cl)c1ccc(C#N)c(Cl)c1)c1nnc(C)o1