Reaction Details
TargetMitogen-activated protein kinase 1
LigandBDBM50295878
Substrate/Competitorn/a
Meas. Tech.ChEMBL_578767 (CHEMBL1052340)
IC50 1300±n/a nM
Citation Akue-Gedu, RDebiton, EFerandin, YMeijer, LPrudhomme, MAnizon, FMoreau, P Synthesis and biological activities of aminopyrimidyl-indoles structurally related to meridianins. Bioorg Med Chem17:4420-4 (2009) 
 
Mitogen-activated protein kinase 1
Name:Mitogen-activated protein kinase 1
Type:Enzyme
Mol. Mass.:41278.65
Organism:Rattus norvegicus (rat)
Description:MAP Kinase is the rat ERK-2 isoform containing a polyhistidine tag at the N-terminus produced in E.coli. and activated by phosphorylation with MEK1 prior to purification.
Residue:358
BDBM50295878
NameBDBM50295878
Synonyms:4-(1-Methyl-1H-indol-3-yl)-5-(pyridin-4-yl)pyrimidin-2-amine | CHEMBL563962
TypeSmall organic molecule
Emp. Form.C18H15N5
Mol. Mass.301.3452
SMILESCn1cc(-c2nc(N)ncc2-c2ccncc2)c2ccccc12