Reaction Details
TargetCyclin-dependent kinase 5
LigandBDBM50295874
Substrate/Competitorn/a
Meas. Tech.ChEMBL_578764 (CHEMBL1052337)
IC50 11000±n/a nM
Citation Akue-Gedu, RDebiton, EFerandin, YMeijer, LPrudhomme, MAnizon, FMoreau, P Synthesis and biological activities of aminopyrimidyl-indoles structurally related to meridianins. Bioorg Med Chem17:4420-4 (2009) 
 
Cyclin-dependent kinase 5
Name:Cyclin-dependent kinase 5
Type:Enzyme Subunit
Mol. Mass.:33308.61
Organism:Homo sapiens (Human)
Description:n/a
Residue:292
BDBM50295874
NameBDBM50295874
Synonyms:4-(1H-indol-3-yl)-5-(4-(trifluoromethyl)phenyl)pyrimidin-2-amine | CHEMBL550658
TypeSmall organic molecule
Emp. Form.C19H13F3N4
Mol. Mass.354.3285
SMILESNc1ncc(-c2ccc(cc2)C(F)(F)F)c(n1)-c1c[nH]c2ccccc12