Reaction Details
TargetCyclin-dependent kinase 5
LigandBDBM50295880
Substrate/Competitorn/a
Meas. Tech.ChEMBL_578764 (CHEMBL1052337)
IC50>10000±n/a nM
Citation Akue-Gedu, RDebiton, EFerandin, YMeijer, LPrudhomme, MAnizon, FMoreau, P Synthesis and biological activities of aminopyrimidyl-indoles structurally related to meridianins. Bioorg Med Chem17:4420-4 (2009) 
 
Cyclin-dependent kinase 5
Name:Cyclin-dependent kinase 5
Type:Enzyme Subunit
Mol. Mass.:33308.61
Organism:Homo sapiens (Human)
Description:n/a
Residue:292
BDBM50295880
NameBDBM50295880
Synonyms:4-[2-Amino-4-(1-methyl-1H-indol-3-yl)pyrimidin-5-yl]benzamide | CHEMBL560521
TypeSmall organic molecule
Emp. Form.C20H17N5O
Mol. Mass.343.3819
SMILESCn1cc(-c2nc(N)ncc2-c2ccc(cc2)C(N)=O)c2ccccc12