Reaction Details
TargetMelanin-concentrating hormone receptor 1
LigandBDBM50296019
Substrate/Competitorn/a
Meas. Tech.ChEMBL_579348 (CHEMBL1063189)
IC50 4±n/a nM
Citation Berglund, SEgner, BJGradén, HGradén, JMorgan, DGInghardt, TGiordanetto, F Optimization of 2-piperidin-4-yl-acetamides as melanin-concentrating hormone receptor 1 (MCH-R1) antagonists: Designing out hERG inhibition. Bioorg Med Chem Lett19:4268-73 (2009) 
 
Melanin-concentrating hormone receptor 1
Name:Melanin-concentrating hormone receptor 1
Type:G Protein-Coupled Receptor (GPCR)
Mol. Mass.:45976.27
Organism:Homo sapiens (Human)
Description:Membranes from CHO-K1 cells stably expressing human MCH1R were used in assays.
Residue:422
BDBM50296019
NameBDBM50296019
Synonyms:CHEMBL549635 | N-(4-fluorobenzyl)-N-(3-hydroxypropyl)-2-(1-((1-(4-(trifluoromethyl)phenyl)-1H-pyrrol-3-yl)methyl)piperidin-4-yl)acetamide
TypeSmall organic molecule
Emp. Form.C29H33F4N3O2
Mol. Mass.531.5848
SMILESOCCCN(Cc1ccc(F)cc1)C(=O)CC1CCN(Cc2ccn(c2)-c2ccc(cc2)C(F)(F)F)CC1