Reaction Details
TargetFatty-acid amide hydrolase 1 [30-579]
LigandBDBM50296485
Substrate/Competitorn/a
Meas. Tech.ChEMBL_581831 (CHEMBL1064167)
IC50>10000±n/a nM
Citation Hart, TMacias, ATBenwell, KBrooks, TD'Alessandro, JDokurno, PFrancis, GGibbons, BHaymes, TKennett, GLightowler, SMansell, HMatassova, NMisra, APadfield, AParsons, RPratt, RRobertson, AWalls, SWong, MRoughley, S Fatty acid amide hydrolase inhibitors. Surprising selectivity of chiral azetidine ureas. Bioorg Med Chem Lett19:4241-4 (2009) 
 
Fatty-acid amide hydrolase 1 [30-579]
Name:Fatty-acid amide hydrolase 1 [30-579]
Type:Single-pass membrane protein; homodimer
Mol. Mass.:60474.00
Organism:Rattus norvegicus (rat)
Description:P97612 (aa 30-579)
Residue:550
BDBM50296485
NameBDBM50296485
Synonyms:(R)-{3-[(4-Chlorophenyl)-(2-chloropyridin-3-yl)methoxy]azetidin-1-yl}piperidin-1-ylmethanone VER-156085
TypeSmall organic molecule
Emp. Form.C21H23Cl2N3O2
Mol. Mass.420.332
SMILESClc1ccc(cc1)[C@@H](OC1CN(C1)C(=O)N1CCCCC1)c1cccnc1Cl