Reaction Details
TargetIntegrin alpha-V
LigandBDBM50296597
Substrate/Competitorn/a
Meas. Tech.ChEMBL_582336 (CHEMBL1053400)
IC50 24±n/a nM
Citation Elliot, DHenshaw, EMacFaul, PAMorley, ADNewham, POldham, KPage, KRankine, NSharpe, PTing, AWood, CM Novel inhibitors of the alphavbeta3 integrin--lead identification strategy. Bioorg Med Chem Lett19:4832-5 (2009) 
 
Integrin alpha-V
Name:Integrin alpha-V
Type:PROTEIN
Mol. Mass.:116024.92
Organism:Homo sapiens (Human)
Description:ChEMBL_582336
Residue:1048
BDBM50296597
NameBDBM50296597
Synonyms:(R)-3-(thiophene-3-carboxamido)-2-(2,4,6-trichlorophenylsulfonamido)propanoic acid | CHEMBL562067
TypeSmall organic molecule
Emp. Form.C14H11Cl3N2O5S2
Mol. Mass.457.737
SMILESOC(=O)[C@@H](CNC(=O)c1ccsc1)NS(=O)(=O)c1c(Cl)cc(Cl)cc1Cl