Reaction Details
TargetIntegrin alpha-V
LigandBDBM50296598
Substrate/Competitorn/a
Meas. Tech.ChEMBL_582336 (CHEMBL1053400)
IC50 8±n/a nM
Citation Elliot, DHenshaw, EMacFaul, PAMorley, ADNewham, POldham, KPage, KRankine, NSharpe, PTing, AWood, CM Novel inhibitors of the alphavbeta3 integrin--lead identification strategy. Bioorg Med Chem Lett19:4832-5 (2009) 
 
Integrin alpha-V
Name:Integrin alpha-V
Type:PROTEIN
Mol. Mass.:116024.92
Organism:Homo sapiens (Human)
Description:ChEMBL_582336
Residue:1048
BDBM50296598
NameBDBM50296598
Synonyms:(R)-2-(2,4-dichlorophenylsulfonamido)-3-(thiophene-3-carboxamido)propanoic acid | CHEMBL550802
TypeSmall organic molecule
Emp. Form.C14H12Cl2N2O5S2
Mol. Mass.423.291
SMILESOC(=O)[C@@H](CNC(=O)c1ccsc1)NS(=O)(=O)c1ccc(Cl)cc1Cl