Reaction Details
TargetNociceptin receptor
LigandBDBM50296930
Substrate/Competitorn/a
Meas. Tech.ChEMBL_580796 (CHEMBL1059778)
IC50 7.6±n/a nM
Citation Sugimoto, YKobayashi, KAsai, MOhno, AYamada, KOzaki, SOhta, HOkamoto, O Synthesis and biological evaluation of imidazole derivatives as novel NOP/ORL1 receptor antagonists: exploration and optimization of alternative pyrazole structure. Bioorg Med Chem Lett19:4611-6 (2009) 
 
Nociceptin receptor
Name:Nociceptin receptor
Type:G Protein-Coupled Receptor (GPCR)
Mol. Mass.:40702.87
Organism:Homo sapiens (Human)
Description:P41146
Residue:370
BDBM50296930
NameBDBM50296930
Synonyms:(1S,3R)-N-((5-(4-chlorophenyl)-1-isopropyl-4-(2-methoxyethyl)-1H-imidazol-2-yl)methyl)-3-fluorocyclopentanamine | CHEMBL563593
TypeSmall organic molecule
Emp. Form.C21H29ClFN3O
Mol. Mass.393.926
SMILESCOCCc1nc(CN[C@H]2CC[C@@H](F)C2)n(C(C)C)c1-c1ccc(Cl)cc1