Reaction Details
TargetPotassium voltage-gated channel subfamily H member 2
LigandBDBM50296914
Substrate/Competitorn/a
Meas. Tech.ChEMBL_580799 (CHEMBL1059781)
IC50 15000±n/a nM
Citation Sugimoto, YKobayashi, KAsai, MOhno, AYamada, KOzaki, SOhta, HOkamoto, O Synthesis and biological evaluation of imidazole derivatives as novel NOP/ORL1 receptor antagonists: exploration and optimization of alternative pyrazole structure. Bioorg Med Chem Lett19:4611-6 (2009) 
 
Potassium voltage-gated channel subfamily H member 2
Name:Potassium voltage-gated channel subfamily H member 2
Type:Multi-pass membrane protein
Mol. Mass.:126672.65
Organism:Homo sapiens (Human)
Description:Q12809
Residue:1159
BDBM50296914
NameBDBM50296914
Synonyms:(1S,3R)-N-((2-(3-chloropyridin-2-yl)-5-isopropyl-1-(6-methylpyridin-3-yl)-1H-imidazol-4-yl)methyl)-3-fluorocyclopentanamine | CHEMBL561397
TypeSmall organic molecule
Emp. Form.C23H27ClFN5
Mol. Mass.427.945
SMILESCC(C)c1c(CN[C@H]2CC[C@@H](F)C2)nc(-c2ncccc2Cl)n1-c1ccc(C)nc1