Reaction Details
TargetTyrosine-protein kinase ABL1
LigandBDBM50224374
Substrate/Competitorn/a
Meas. Tech.ChEMBL_583409 (CHEMBL1056610)
Ki 110±n/a nM
Citation Dreassi, EZizzari, ATFalchi, FSchenone, SSantucci, AMaga, GBotta, M Determination of permeability and lipophilicity of pyrazolo-pyrimidine tyrosine kinase inhibitors and correlation with biological data. Eur J Med Chem44:3712-7 (2009) 
 
Tyrosine-protein kinase ABL1
Name:Tyrosine-protein kinase ABL1
Type:Enzyme
Mol. Mass.:122897.30
Organism:Homo sapiens (Human)
Description:P00519
Residue:1130
BDBM50224374
NameBDBM50224374
Synonyms:CHEMBL241749 | N-benzyl-1-(2-chloro-2-(4-chlorophenyl)ethyl)-6-(methylthio)-1H-pyrazolo[3,4-d]pyrimidin-4-amine
TypeSmall organic molecule
Emp. Form.C21H19Cl2N5S
Mol. Mass.444.38
SMILESCSc1nc(NCc2ccccc2)c2cnn(CC(Cl)c3ccc(Cl)cc3)c2n1