Reaction Details
TargetTyrosine-protein kinase ABL1
LigandBDBM50224388
Substrate/Competitorn/a
Meas. Tech.ChEMBL_583409 (CHEMBL1056610)
Ki 60±n/a nM
Citation Dreassi, EZizzari, ATFalchi, FSchenone, SSantucci, AMaga, GBotta, M Determination of permeability and lipophilicity of pyrazolo-pyrimidine tyrosine kinase inhibitors and correlation with biological data. Eur J Med Chem44:3712-7 (2009) 
 
Tyrosine-protein kinase ABL1
Name:Tyrosine-protein kinase ABL1
Type:Enzyme
Mol. Mass.:122897.30
Organism:Homo sapiens (Human)
Description:P00519
Residue:1130
BDBM50224388
NameBDBM50224388
Synonyms:CHEMBL238561 | N-(3-bromophenyl)-1-(2-chloro-2-phenylethyl)-6-(methylthio)-1H-pyrazolo[3,4-d]pyrimidin-4-amine
TypeSmall organic molecule
Emp. Form.C20H17BrClN5S
Mol. Mass.474.804
SMILESCSc1nc(Nc2cccc(Br)c2)c2cnn(CC(Cl)c3ccccc3)c2n1