Reaction Details
TargetProto-oncogene tyrosine-protein kinase Src
LigandBDBM50224371
Substrate/Competitorn/a
Meas. Tech.ChEMBL_583405 (CHEMBL1056606)
Ki 500±n/a nM
Citation Dreassi, EZizzari, ATFalchi, FSchenone, SSantucci, AMaga, GBotta, M Determination of permeability and lipophilicity of pyrazolo-pyrimidine tyrosine kinase inhibitors and correlation with biological data. Eur J Med Chem44:3712-7 (2009) 
 
Proto-oncogene tyrosine-protein kinase Src
Name:Proto-oncogene tyrosine-protein kinase Src
Type:Protein
Mol. Mass.:59838.60
Organism:Homo sapiens (Human)
Description:P12931
Residue:536
BDBM50224371
NameBDBM50224371
Synonyms:1-(2-chloro-2-phenylethyl)-N-(3-chlorophenyl)-6-(ethylthio)-1H-pyrazolo[3,4-d]pyrimidin-4-amine | CHEMBL428029
TypeSmall organic molecule
Emp. Form.C21H19Cl2N5S
Mol. Mass.444.38
SMILESCCSc1nc(Nc2cccc(Cl)c2)c2cnn(CC(Cl)c3ccccc3)c2n1