Reaction Details
TargetCannabinoid receptor 2
LigandBDBM50297592
Substrate/Competitorn/a
Meas. Tech.ChEMBL_583691 (CHEMBL1061737)
EC50 439±n/a nM
Citation Ryckmans, TEdwards, MPHorne, VACorreia, AMOwen, DRThompson, LRTran, ITutt, MFYoung, T Rapid assessment of a novel series of selective CB(2) agonists using parallel synthesis protocols: A Lipophilic Efficiency (LipE) analysis. Bioorg Med Chem Lett19:4406-9 (2009) 
 
Cannabinoid receptor 2
Name:Cannabinoid receptor 2
Type:G Protein-Coupled Receptor (GPCR)
Mol. Mass.:39690.94
Organism:Homo sapiens (Human)
Description:P34972
Residue:360
BDBM50297592
NameBDBM50297592
Synonyms:1-(cyclopropylmethyl)-5-(methylsulfonyl)-2-neopentyl-4,5,6,7-tetrahydro-1H-imidazo[4,5-c]pyridine | CHEMBL563446
TypeSmall organic molecule
Emp. Form.C16H27N3O2S
Mol. Mass.325.469
SMILESCC(C)(C)Cc1nc2CN(CCc2n1CC1CC1)S(C)(=O)=O