Reaction Details
TargetCannabinoid receptor 2
LigandBDBM50297593
Substrate/Competitorn/a
Meas. Tech.ChEMBL_583691 (CHEMBL1061737)
EC50 403±n/a nM
Citation Ryckmans, TEdwards, MPHorne, VACorreia, AMOwen, DRThompson, LRTran, ITutt, MFYoung, T Rapid assessment of a novel series of selective CB(2) agonists using parallel synthesis protocols: A Lipophilic Efficiency (LipE) analysis. Bioorg Med Chem Lett19:4406-9 (2009) 
 
Cannabinoid receptor 2
Name:Cannabinoid receptor 2
Type:G Protein-Coupled Receptor (GPCR)
Mol. Mass.:39690.94
Organism:Homo sapiens (Human)
Description:P34972
Residue:360
BDBM50297593
NameBDBM50297593
Synonyms:2-tert-butyl-1-(cyclopropylmethyl)-5-(methylsulfonyl)-4,5,6,7-tetrahydro-1H-imidazo[4,5-c]pyridine | CHEMBL558857
TypeSmall organic molecule
Emp. Form.C15H25N3O2S
Mol. Mass.311.443
SMILESCC(C)(C)c1nc2CN(CCc2n1CC1CC1)S(C)(=O)=O