Reaction Details
TargetCannabinoid receptor 2
LigandBDBM50297595
Substrate/Competitorn/a
Meas. Tech.ChEMBL_583691 (CHEMBL1061737)
EC50 26.7±n/a nM
Citation Ryckmans, TEdwards, MPHorne, VACorreia, AMOwen, DRThompson, LRTran, ITutt, MFYoung, T Rapid assessment of a novel series of selective CB(2) agonists using parallel synthesis protocols: A Lipophilic Efficiency (LipE) analysis. Bioorg Med Chem Lett19:4406-9 (2009) 
 
Cannabinoid receptor 2
Name:Cannabinoid receptor 2
Type:G Protein-Coupled Receptor (GPCR)
Mol. Mass.:39690.94
Organism:Homo sapiens (Human)
Description:P34972
Residue:360
BDBM50297595
NameBDBM50297595
Synonyms:2-tert-butyl-1-(cyclopropylmethyl)-5-(2-methoxyethylsulfonyl)-4,5,6,7-tetrahydro-1H-imidazo[4,5-c]pyridine | CHEMBL550742
TypeSmall organic molecule
Emp. Form.C17H29N3O3S
Mol. Mass.355.495
SMILESCOCCS(=O)(=O)N1CCc2c(C1)nc(n2CC1CC1)C(C)(C)C