Reaction Details
TargetCannabinoid receptor 2
LigandBDBM50297605
Substrate/Competitorn/a
Meas. Tech.ChEMBL_583691 (CHEMBL1061737)
EC50 9.1±n/a nM
Citation Ryckmans, TEdwards, MPHorne, VACorreia, AMOwen, DRThompson, LRTran, ITutt, MFYoung, T Rapid assessment of a novel series of selective CB(2) agonists using parallel synthesis protocols: A Lipophilic Efficiency (LipE) analysis. Bioorg Med Chem Lett19:4406-9 (2009) 
 
Cannabinoid receptor 2
Name:Cannabinoid receptor 2
Type:G Protein-Coupled Receptor (GPCR)
Mol. Mass.:39690.94
Organism:Homo sapiens (Human)
Description:P34972
Residue:360
BDBM50297605
NameBDBM50297605
Synonyms:1-(cyclopropylmethyl)-2-neopentyl-5-(phenylsulfonyl)-4,5,6,7-tetrahydro-1H-imidazo[4,5-c]pyridine | CHEMBL563352
TypeSmall organic molecule
Emp. Form.C21H29N3O2S
Mol. Mass.387.539
SMILESCC(C)(C)Cc1nc2CN(CCc2n1CC1CC1)S(=O)(=O)c1ccccc1