Reaction Details
TargetCannabinoid receptor 2
LigandBDBM50297607
Substrate/Competitorn/a
Meas. Tech.ChEMBL_583691 (CHEMBL1061737)
EC50 18.5±n/a nM
Citation Ryckmans, TEdwards, MPHorne, VACorreia, AMOwen, DRThompson, LRTran, ITutt, MFYoung, T Rapid assessment of a novel series of selective CB(2) agonists using parallel synthesis protocols: A Lipophilic Efficiency (LipE) analysis. Bioorg Med Chem Lett19:4406-9 (2009) 
 
Cannabinoid receptor 2
Name:Cannabinoid receptor 2
Type:G Protein-Coupled Receptor (GPCR)
Mol. Mass.:39690.94
Organism:Homo sapiens (Human)
Description:P34972
Residue:360
BDBM50297607
NameBDBM50297607
Synonyms:4-(1-(cyclopropylmethyl)-2-neopentyl-6,7-dihydro-1H-imidazo[4,5-c]pyridin-5(4H)-ylsulfonyl)-3-methylisoxazole | CHEMBL563085
TypeSmall organic molecule
Emp. Form.C19H28N4O3S
Mol. Mass.392.516
SMILESCc1nocc1S(=O)(=O)N1CCc2c(C1)nc(CC(C)(C)C)n2CC1CC1