Reaction Details
TargetCannabinoid receptor 1
LigandBDBM50297594
Substrate/Competitorn/a
Meas. Tech.ChEMBL_583693 (CHEMBL1061739)
EC50 14000±n/a nM
Citation Ryckmans, TEdwards, MPHorne, VACorreia, AMOwen, DRThompson, LRTran, ITutt, MFYoung, T Rapid assessment of a novel series of selective CB(2) agonists using parallel synthesis protocols: A Lipophilic Efficiency (LipE) analysis. Bioorg Med Chem Lett19:4406-9 (2009) 
 
Cannabinoid receptor 1
Name:Cannabinoid receptor 1
Type:G Protein-Coupled Receptor (GPCR)
Mol. Mass.:52868.96
Organism:Homo sapiens (Human)
Description:P21554
Residue:472
BDBM50297594
NameBDBM50297594
Synonyms:1-(cyclopropylmethyl)-5-(2-methoxyethylsulfonyl)-2-neopentyl-4,5,6,7-tetrahydro-1H-imidazo[4,5-c]pyridine | CHEMBL560208
TypeSmall organic molecule
Emp. Form.C18H31N3O3S
Mol. Mass.369.522
SMILESCOCCS(=O)(=O)N1CCc2c(C1)nc(CC(C)(C)C)n2CC1CC1