Reaction Details
TargetMelanin-concentrating hormone receptor 1
LigandBDBM50297624
Substrate/Competitorn/a
Meas. Tech.ChEMBL_583694 (CHEMBL1061740)
IC50 10±n/a nM
Citation Berglund, SEgner, BJGradén, HGradén, JMorgan, DGInghardt, TGiordanetto, F Optimization of piperidin-4-yl-urea-containing melanin-concentrating hormone receptor 1 (MCH-R1) antagonists: Reducing hERG-associated liabilities. Bioorg Med Chem Lett19:4274-9 (2009) 
 
Melanin-concentrating hormone receptor 1
Name:Melanin-concentrating hormone receptor 1
Type:G Protein-Coupled Receptor (GPCR)
Mol. Mass.:45976.27
Organism:Homo sapiens (Human)
Description:Membranes from CHO-K1 cells stably expressing human MCH1R were used in assays.
Residue:422
BDBM50297624
NameBDBM50297624
Synonyms:1-phenyl-N-(1-((1-(4-(trifluoromethyl)phenyl)-1H-pyrrol-3-yl)methyl)piperidin-4-yl)-3,4-dihydropyrrolo[1,2-a]pyrazine-2(1H)-carboxamide | CHEMBL550068
TypeSmall organic molecule
Emp. Form.C31H32F3N5O
Mol. Mass.547.6139
SMILESFC(F)(F)c1ccc(cc1)-n1ccc(CN2CCC(CC2)NC(=O)N2CCn3cccc3C2c2ccccc2)c1