Reaction Details
TargetProgesterone receptor
LigandBDBM50298214
Substrate/Competitorn/a
Meas. Tech.ChEMBL_585528 (CHEMBL1062692)
EC50 70±n/a nM
Citation Washburn, DGHoang, THFrazee, JSJohnson, LHammond, MManns, SMadauss, KPWilliams, SPDuraiswami, CTran, TBStewart, ELGrygielko, ETGlace, LETrizna, WNagilla, RBray, JDThompson, SK Discovery of orally active, pyrrolidinone-based progesterone receptor partial agonists. Bioorg Med Chem Lett19:4664-8 (2009) 
 
Progesterone receptor
Name:Progesterone receptor
Type:Protein
Mol. Mass.:98979.52
Organism:Homo sapiens (Human)
Description:P06401
Residue:933
BDBM50298214
NameBDBM50298214
Synonyms:(S)-2-chloro-4-((1-methyl-5-oxopyrrolidin-3-yl)(2-(trifluoromethyl)benzyl)amino)benzonitrile | CHEMBL565157
TypeSmall organic molecule
Emp. Form.C20H17ClF3N3O
Mol. Mass.407.817
SMILESCN1C[C@H](CC1=O)N(Cc1ccccc1C(F)(F)F)c1ccc(C#N)c(Cl)c1