Reaction Details
TargetRAC-alpha serine/threonine-protein kinase
LigandBDBM16931
Substrate/Competitorn/a
Meas. Tech.ChEMBL_587680 (CHEMBL1049250)
IC50 99±n/a nM
Citation Dong, XJiang, CHu, HYan, JChen, JHu, Y QSAR study of Akt/protein kinase B (PKB) inhibitors using support vector machine. Eur J Med Chem44:4090-7 (2009) 
 
RAC-alpha serine/threonine-protein kinase
Name:RAC-alpha serine/threonine-protein kinase
Type:Enzyme
Mol. Mass.:55681.25
Organism:Homo sapiens (Human)
Description:P31749
Residue:480
BDBM16931
NameBDBM16931
Synonyms:6-(5-{[(2S)-2-amino-3-(1H-indol-3-yl)propyl]oxy}pyridin-3-yl)-1,3-benzothiazol-2(3H)-one benzothiazol-2-one, 9m
TypeSmall organic molecule
Emp. Form.C23H20N4O2S
Mol. Mass.416.496
SMILESN[C@H](COc1cncc(c1)-c1ccc2[nH]c(=O)sc2c1)Cc1c[nH]c2ccccc12