Reaction Details
TargetRAC-alpha serine/threonine-protein kinase
LigandBDBM16784
Substrate/Competitorn/a
Meas. Tech.ChEMBL_587680 (CHEMBL1049250)
IC50 1±n/a nM
Citation Dong, XJiang, CHu, HYan, JChen, JHu, Y QSAR study of Akt/protein kinase B (PKB) inhibitors using support vector machine. Eur J Med Chem44:4090-7 (2009) 
 
RAC-alpha serine/threonine-protein kinase
Name:RAC-alpha serine/threonine-protein kinase
Type:Enzyme
Mol. Mass.:55681.25
Organism:Homo sapiens (Human)
Description:P31749
Residue:480
BDBM16784
NameBDBM16784
Synonyms:5-{5-[(2S)-2-amino-3-(1H-indol-3-yl)propoxy]pyridin-3-yl}-3-chloro-1H-indazole | indazole-pyridine, 2
TypeSmall organic molecule
Emp. Form.C23H20ClN5O
Mol. Mass.417.891
SMILESN[C@H](COc1cncc(c1)-c1ccc2[nH]nc(Cl)c2c1)Cc1c[nH]c2ccccc12