Reaction Details
TargetRAC-alpha serine/threonine-protein kinase
LigandBDBM16786
Substrate/Competitorn/a
Meas. Tech.ChEMBL_587680 (CHEMBL1049250)
IC50 953±n/a nM
Citation Dong, XJiang, CHu, HYan, JChen, JHu, Y QSAR study of Akt/protein kinase B (PKB) inhibitors using support vector machine. Eur J Med Chem44:4090-7 (2009) 
 
RAC-alpha serine/threonine-protein kinase
Name:RAC-alpha serine/threonine-protein kinase
Type:Enzyme
Mol. Mass.:55681.25
Organism:Homo sapiens (Human)
Description:P31749
Residue:480
BDBM16786
NameBDBM16786
Synonyms:5-{5-[(2S)-2-amino-3-(1H-indol-3-yl)propoxy]pyridin-3-yl}-6-nitro-1H-indazole | indazole-pyridine, 9c
TypeSmall organic molecule
Emp. Form.C23H20N6O3
Mol. Mass.428.4433
SMILESN[C@H](COc1cncc(c1)-c1cc2cn[nH]c2cc1[N+]([O-])=O)Cc1c[nH]c2ccccc12