Reaction Details
TargetC-X-C chemokine receptor type 3
LigandBDBM50299165
Substrate/Competitorn/a
Meas. Tech.ChEMBL_592310 (CHEMBL1046685)
IC50 30±n/a nM
Citation Thoma, GBaenteli, RLewis, IWagner, TOberer, LBlum, WGlickman, FStreiff, MBZerwes, HG Special ergolines are highly selective, potent antagonists of the chemokine receptor CXCR3: discovery, characterization and preliminary SAR of a promising lead. Bioorg Med Chem Lett19:6185-8 (2009) 
 
C-X-C chemokine receptor type 3
Name:C-X-C chemokine receptor type 3
Type:PROTEIN
Mol. Mass.:41020.84
Organism:Mus musculus
Description:ChEMBL_560734
Residue:367
BDBM50299165
NameBDBM50299165
Synonyms:(6aR,9R)-N9,N9-diethyl-N7-phenyl-6,6a,8,9-tetrahydroindolo[4,3-fg]quinoline-7,9(4H)-dicarboxamide | CHEMBL584554
TypeSmall organic molecule
Emp. Form.C26H28N4O2
Mol. Mass.428.5261
SMILESCCN(CC)C(=O)[C@H]1CN([C@@H]2Cc3c[nH]c4cccc(C2=C1)c34)C(=O)Nc1ccccc1