Reaction Details
TargetAmine oxidase [flavin-containing] B
LigandBDBM50299420
Substrate/Competitorn/a
Meas. Tech.ChEMBL_590725 (CHEMBL1049125)
IC50 2400±n/a nM
Citation Pisani, LMuncipinto, GMiscioscia, TFNicolotti, OLeonetti, FCatto, MCaccia, CSalvati, PSoto-Otero, RMendez-Alvarez, EPasseleu, CCarotti, A Discovery of a novel class of potent coumarin monoamine oxidase B inhibitors: development and biopharmacological profiling of 7-[(3-chlorobenzyl)oxy]-4-[(methylamino)methyl]-2H-chromen-2-one methanesulfonate (NW-1772) as a highly potent, selective, reversible, and orally active monoamine oxidase B  J Med Chem52:6685-706 (2009) 
 
Amine oxidase [flavin-containing] B
Name:Amine oxidase [flavin-containing] B
Type:Enzyme
Mol. Mass.:58469.65
Organism:Rattus norvegicus (rat)
Description:P19643
Residue:520
BDBM50299420
NameBDBM50299420
Synonyms:CHEMBL575907 | N2-{7-[(3-Chlorobenzyl)oxy]-2-oxo-2H-chromen-4-yl}serinamide
TypeSmall organic molecule
Emp. Form.C19H17ClN2O5
Mol. Mass.388.802
SMILESNC(=O)[C@H](CO)Nc1cc(=O)oc2cc(OCc3cccc(Cl)c3)ccc12