Reaction Details
TargetAmine oxidase [flavin-containing] A
LigandBDBM50299438
Substrate/Competitorn/a
Meas. Tech.ChEMBL_590557 (CHEMBL1062055)
IC50 2800±n/a nM
Citation Pisani, LMuncipinto, GMiscioscia, TFNicolotti, OLeonetti, FCatto, MCaccia, CSalvati, PSoto-Otero, RMendez-Alvarez, EPasseleu, CCarotti, A Discovery of a novel class of potent coumarin monoamine oxidase B inhibitors: development and biopharmacological profiling of 7-[(3-chlorobenzyl)oxy]-4-[(methylamino)methyl]-2H-chromen-2-one methanesulfonate (NW-1772) as a highly potent, selective, reversible, and orally active monoamine oxidase B  J Med Chem52:6685-706 (2009) 
 
Amine oxidase [flavin-containing] A
Name:Amine oxidase [flavin-containing] A
Type:Enzyme
Mol. Mass.:59515.21
Organism:Rattus norvegicus (rat)
Description:n/a
Residue:526
BDBM50299438
NameBDBM50299438
Synonyms:2-[7-(Benzyloxy)-2-oxo-2H-chromen-4-yl]-N-methylacetamide | CHEMBL573300
TypeSmall organic molecule
Emp. Form.C19H17NO4
Mol. Mass.323.3426
SMILESCNC(=O)Cc1cc(=O)oc2cc(OCc3ccccc3)ccc12