Reaction Details
TargetAmine oxidase [flavin-containing] A
LigandBDBM50299445
Substrate/Competitorn/a
Meas. Tech.ChEMBL_590557 (CHEMBL1062055)
IC50 13500±n/a nM
Citation Pisani, LMuncipinto, GMiscioscia, TFNicolotti, OLeonetti, FCatto, MCaccia, CSalvati, PSoto-Otero, RMendez-Alvarez, EPasseleu, CCarotti, A Discovery of a novel class of potent coumarin monoamine oxidase B inhibitors: development and biopharmacological profiling of 7-[(3-chlorobenzyl)oxy]-4-[(methylamino)methyl]-2H-chromen-2-one methanesulfonate (NW-1772) as a highly potent, selective, reversible, and orally active monoamine oxidase B  J Med Chem52:6685-706 (2009) 
 
Amine oxidase [flavin-containing] A
Name:Amine oxidase [flavin-containing] A
Type:Enzyme
Mol. Mass.:59515.21
Organism:Rattus norvegicus (rat)
Description:n/a
Residue:526
BDBM50299445
NameBDBM50299445
Synonyms:7-[(3-Fluorobenzyl)oxy]-4-[(methylamino)methyl]-2H-chromen-2-one Methanesulfonate | CHEMBL575285
TypeSmall organic molecule
Emp. Form.C18H16FNO3
Mol. Mass.313.3229
SMILESCNCc1cc(=O)oc2cc(OCc3cccc(F)c3)ccc12