Reaction Details
TargetAmine oxidase [flavin-containing] A
LigandBDBM50299458
Substrate/Competitorn/a
Meas. Tech.ChEMBL_590557 (CHEMBL1062055)
IC50 500±n/a nM
Citation Pisani, LMuncipinto, GMiscioscia, TFNicolotti, OLeonetti, FCatto, MCaccia, CSalvati, PSoto-Otero, RMendez-Alvarez, EPasseleu, CCarotti, A Discovery of a novel class of potent coumarin monoamine oxidase B inhibitors: development and biopharmacological profiling of 7-[(3-chlorobenzyl)oxy]-4-[(methylamino)methyl]-2H-chromen-2-one methanesulfonate (NW-1772) as a highly potent, selective, reversible, and orally active monoamine oxidase B  J Med Chem52:6685-706 (2009) 
 
Amine oxidase [flavin-containing] A
Name:Amine oxidase [flavin-containing] A
Type:Enzyme
Mol. Mass.:59515.21
Organism:Rattus norvegicus (rat)
Description:n/a
Residue:526
BDBM50299458
NameBDBM50299458
Synonyms:2-{7-[(3-Chlorobenzyl)oxy]-2-oxo-2H-chromen-4-yl}-N-methylacetamide | CHEMBL575931
TypeSmall organic molecule
Emp. Form.C19H16ClNO4
Mol. Mass.357.788
SMILESCNC(=O)Cc1cc(=O)oc2cc(OCc3cccc(Cl)c3)ccc12