Reaction Details
TargetAmine oxidase [flavin-containing] B
LigandBDBM50299425
Substrate/Competitorn/a
Meas. Tech.ChEMBL_590725 (CHEMBL1049125)
IC50 510±n/a nM
Citation Pisani, LMuncipinto, GMiscioscia, TFNicolotti, OLeonetti, FCatto, MCaccia, CSalvati, PSoto-Otero, RMendez-Alvarez, EPasseleu, CCarotti, A Discovery of a novel class of potent coumarin monoamine oxidase B inhibitors: development and biopharmacological profiling of 7-[(3-chlorobenzyl)oxy]-4-[(methylamino)methyl]-2H-chromen-2-one methanesulfonate (NW-1772) as a highly potent, selective, reversible, and orally active monoamine oxidase B  J Med Chem52:6685-706 (2009) 
 
Amine oxidase [flavin-containing] B
Name:Amine oxidase [flavin-containing] B
Type:Enzyme
Mol. Mass.:58469.65
Organism:Rattus norvegicus (rat)
Description:P19643
Residue:520
BDBM50299425
NameBDBM50299425
Synonyms:4-[(Dimethylamino)methyl]-7-[(3-fluorobenzyl)oxy]-2H-chromen-2-one | CHEMBL575521
TypeSmall organic molecule
Emp. Form.C19H18FNO3
Mol. Mass.327.3495
SMILESCN(C)Cc1cc(=O)oc2cc(OCc3cccc(F)c3)ccc12