Reaction Details
TargetE3 ubiquitin-protein ligase Mdm2
LigandBDBM50299823
Substrate/Competitorn/a
Meas. Tech.ChEMBL_589608 (CHEMBL1052161)
IC50>50000±n/a nM
Citation Allen, JGBourbeau, MPWohlhieter, GEBartberger, MDMichelsen, KHungate, RGadwood, RCGaston, RDEvans, BMann, LWMatison, MESchneider, SHuang, XYu, DAndrews, PSReichelt, ALong, AMYakowec, PYang, EYLee, TAOliner, JD Discovery and optimization of chromenotriazolopyrimidines as potent inhibitors of the mouse double minute 2-tumor protein 53 protein-protein interaction. J Med Chem52:7044-53 (2009) 
 
E3 ubiquitin-protein ligase Mdm2
Name:E3 ubiquitin-protein ligase Mdm2
Type:Oncoprotein
Mol. Mass.:55196.54
Organism:Homo sapiens (Human)
Description:Q00987
Residue:491
BDBM50299823
NameBDBM50299823
Synonyms:(6R,7S)-6,7-bis(4-bromophenyl)-7,11-dihydro-6H-chromeno[4,3-d][1,2,4]triazolo[1,5-a]pyrimidine CHEMBL567426
TypeSmall organic molecule
Emp. Form.C24H16Br2N4O
Mol. Mass.536.218
SMILESBrc1ccc(cc1)[C@H]1Oc2ccccc2C2=Nc3ncnn3[C@H](C12)c1ccc(Br)cc1