Reaction Details
TargetBeta-2 adrenergic receptor
LigandBDBM50299900
Substrate/Competitorn/a
Meas. Tech.ChEMBL_590086 (CHEMBL1044765)
EC50 0.100000±n/a nM
Citation Hoenke, CBouyssou, TTautermann, CSRudolf, KSchnapp, AKonetzki, I Use of 5-hydroxy-4H-benzo[1,4]oxazin-3-ones as beta2-adrenoceptor agonists. Bioorg Med Chem Lett19:6640-4 (2009) 
 
Beta-2 adrenergic receptor
Name:Beta-2 adrenergic receptor
Type:n/a
Mol. Mass.:46461.69
Organism:Homo sapiens (Human)
Description:P07550
Residue:413
BDBM50299900
NameBDBM50299900
Synonyms:5-hydroxy-8-(1-hydroxy-2-(2-methyl-1-o-tolylpropan-2-ylamino)ethyl)-2H-benzo[b][1,4]oxazin-3(4H)-one | CHEMBL579394
TypeSmall organic molecule
Emp. Form.C21H26N2O4
Mol. Mass.370.4421
SMILESCc1ccccc1CC(C)(C)NCC(O)c1ccc(O)c2NC(=O)COc12