Reaction Details
TargetEpidermal growth factor receptor
LigandBDBM50300026
Substrate/Competitorn/a
Meas. Tech.ChEMBL_593141 (CHEMBL1044055)
IC50 13±n/a nM
Citation Cha, MYLee, KOKim, JWLee, CGSong, JYKim, YHLee, GSPark, SBKim, MS Discovery of a novel Her-1/Her-2 dual tyrosine kinase inhibitor for the treatment of Her-1 selective inhibitor-resistant non-small cell lung cancer. J Med Chem52:6880-8 (2009) 
 
Epidermal growth factor receptor
Name:Epidermal growth factor receptor
Type:Receptor Kinase Domain
Mol. Mass.:134279.59
Organism:Homo sapiens (Human)
Description:P00533
Residue:1210
BDBM50300026
NameBDBM50300026
Synonyms:(S)-1-Acryloyl-N-[4-(3-chloro-2-fluorophenylamino)-7-(2-methoxyethoxy)quinazolin-6-yl]pyrrolidine-2-carboxamide | CHEMBL571040
TypeSmall organic molecule
Emp. Form.C25H25ClFN5O4
Mol. Mass.513.949
SMILESCOCCOc1cc2ncnc(Nc3cccc(Cl)c3F)c2cc1NC(=O)[C@@H]1CCCN1C(=O)C=C