Reaction Details
TargetHistone-lysine N-methyltransferase EHMT2
LigandBDBM50300040
Substrate/Competitorn/a
Meas. Tech.ChEMBL_593233 (CHEMBL1046740)
IC50 9100±n/a nM
Citation Liu, FChen, XAllali-Hassani, AQuinn, AMWasney, GADong, ABarsyte, DKozieradzki, ISenisterra, GChau, ISiarheyeva, AKireev, DBJadhav, AHerold, JMFrye, SVArrowsmith, CHBrown, PJSimeonov, AVedadi, MJin, J Discovery of a 2,4-diamino-7-aminoalkoxyquinazoline as a potent and selective inhibitor of histone lysine methyltransferase G9a. J Med Chem52:7950-3 (2009) 
 
Histone-lysine N-methyltransferase EHMT2
Name:Histone-lysine N-methyltransferase EHMT2
Type:Enzyme
Mol. Mass.:132339.87
Organism:Homo sapiens (Human)
Description:Q96KQ7
Residue:1210
BDBM50300040
NameBDBM50300040
Synonyms:2-chloro-6,7-dimethoxy-N-(1-methylpiperidin-4-yl)quinazolin-4-amine | CHEMBL571951
TypeSmall organic molecule
Emp. Form.C16H21ClN4O2
Mol. Mass.336.817
SMILESCOc1cc2nc(Cl)nc(NC3CCN(C)CC3)c2cc1OC