Reaction Details
TargetRas-related C3 botulinum toxin substrate 1
LigandBDBM50300546
Substrate/Competitorn/a
Meas. Tech.ChEMBL_588743 (CHEMBL1053690)
IC50 58000±n/a nM
Citation Beausoleil, EChauvignac, CTaverne, TLacombe, SPognante, LLeblond, BPallares, DOliveira, CDBachelot, FCarton, RPeillon, HCoutadeur, SPicard, VLambeng, NDésiré, LSchweighoffer, F Structure-activity relationship of isoform selective inhibitors of Rac1/1b GTPase nucleotide binding. Bioorg Med Chem Lett19:5594-8 (2009) 
 
Ras-related C3 botulinum toxin substrate 1
Name:Ras-related C3 botulinum toxin substrate 1
Type:PROTEIN
Mol. Mass.:21455.91
Organism:Homo sapiens (Human)
Description:ChEMBL_1337921
Residue:192
BDBM50300546
NameBDBM50300546
Synonyms:6,7-Dimethoxy-1-methyl-3-naphthalen-2-yl-isoquinolinium chloride | CHEMBL576002
TypeSmall organic molecule
Emp. Form.C22H19NO2
Mol. Mass.329.3918
SMILESCOc1cc2cc(nc(C)c2cc1OC)-c1ccc2ccccc2c1