Reaction Details
TargetRas-related C3 botulinum toxin substrate 1
LigandBDBM50300547
Substrate/Competitorn/a
Meas. Tech.ChEMBL_588743 (CHEMBL1053690)
IC50 8000±n/a nM
Citation Beausoleil, EChauvignac, CTaverne, TLacombe, SPognante, LLeblond, BPallares, DOliveira, CDBachelot, FCarton, RPeillon, HCoutadeur, SPicard, VLambeng, NDésiré, LSchweighoffer, F Structure-activity relationship of isoform selective inhibitors of Rac1/1b GTPase nucleotide binding. Bioorg Med Chem Lett19:5594-8 (2009) 
 
Ras-related C3 botulinum toxin substrate 1
Name:Ras-related C3 botulinum toxin substrate 1
Type:PROTEIN
Mol. Mass.:21455.91
Organism:Homo sapiens (Human)
Description:ChEMBL_1337921
Residue:192
BDBM50300547
NameBDBM50300547
Synonyms:2,3,9,10-Tetrahydroxy-5,6-dihydro-isoquino[3,2-a]isoquinolinylium chloride | CHEMBL572918
TypeSmall organic molecule
Emp. Form.C17H14NO4
Mol. Mass.296.2968
SMILESOc1cc2CCn3cc4c(ccc(O)c4=[OH+])cc3-c2cc1O