Reaction Details
TargetRas-related C3 botulinum toxin substrate 1
LigandBDBM50300551
Substrate/Competitorn/a
Meas. Tech.ChEMBL_588743 (CHEMBL1053690)
IC50 9300±n/a nM
Citation Beausoleil, EChauvignac, CTaverne, TLacombe, SPognante, LLeblond, BPallares, DOliveira, CDBachelot, FCarton, RPeillon, HCoutadeur, SPicard, VLambeng, NDésiré, LSchweighoffer, F Structure-activity relationship of isoform selective inhibitors of Rac1/1b GTPase nucleotide binding. Bioorg Med Chem Lett19:5594-8 (2009) 
 
Ras-related C3 botulinum toxin substrate 1
Name:Ras-related C3 botulinum toxin substrate 1
Type:PROTEIN
Mol. Mass.:21455.91
Organism:Homo sapiens (Human)
Description:ChEMBL_1337921
Residue:192
BDBM50300551
NameBDBM50300551
Synonyms:2,3,7,8-Tetrahydroxy-5-methyl-benzo[c]phenanthridinium chloride | CHEMBL575536
TypeSmall organic molecule
Emp. Form.C18H14NO4
Mol. Mass.308.3075
SMILESCn1cc2c(ccc(O)c2=[OH+])c2ccc3cc(O)c(O)cc3c12