Reaction Details
TargetCannabinoid receptor 1
LigandBDBM50202579
Substrate/Competitorn/a
Meas. Tech.ChEMBL_589971 (CHEMBL1050879)
Ki>10000±n/a nM
Citation Cano, CPáez, JAGoya, PSerrano, APavón, JRodríguez de Fonseca, FSuardíaz, MMartín, MI Synthesis and pharmacological evaluation of sulfamide-based analogues of anandamide. Eur J Med Chem44:4889-95 (2009) 
 
Cannabinoid receptor 1
Name:Cannabinoid receptor 1
Type:G Protein-Coupled Receptor (GPCR)
Mol. Mass.:52856.55
Organism:Rattus norvegicus (rat)
Description:P20272
Residue:473
BDBM50202579
NameBDBM50202579
Synonyms:CHEMBL218794 | N-octadecylsulfamide
TypeSmall organic molecule
Emp. Form.C18H40N2O2S
Mol. Mass.348.587
(N)(=O)=O