Reaction Details
TargetCannabinoid receptor 1
LigandBDBM50300770
Substrate/Competitorn/a
Meas. Tech.ChEMBL_589971 (CHEMBL1050879)
Ki 4010±n/a nM
Citation Cano, CPáez, JAGoya, PSerrano, APavón, JRodríguez de Fonseca, FSuardíaz, MMartín, MI Synthesis and pharmacological evaluation of sulfamide-based analogues of anandamide. Eur J Med Chem44:4889-95 (2009) 
 
Cannabinoid receptor 1
Name:Cannabinoid receptor 1
Type:G Protein-Coupled Receptor (GPCR)
Mol. Mass.:52856.55
Organism:Rattus norvegicus (rat)
Description:P20272
Residue:473
BDBM50300770
NameBDBM50300770
Synonyms:CHEMBL568489 | N-(cis-5-cis-8-cis-11-cis-14-eicosatetraenyl)sulfamide
TypeSmall organic molecule
Emp. Form.C20H36N2O2S
Mol. Mass.368.577
SMILESCCCCC\C=C/C\C=C/C\C=C/C\C=C/CCCCNS(N)(=O)=O