Reaction Details
TargetCannabinoid receptor 1
LigandBDBM50300771
Substrate/Competitorn/a
Meas. Tech.ChEMBL_589971 (CHEMBL1050879)
Ki 6406±n/a nM
Citation Cano, CPáez, JAGoya, PSerrano, APavón, JRodríguez de Fonseca, FSuardíaz, MMartín, MI Synthesis and pharmacological evaluation of sulfamide-based analogues of anandamide. Eur J Med Chem44:4889-95 (2009) 
 
Cannabinoid receptor 1
Name:Cannabinoid receptor 1
Type:G Protein-Coupled Receptor (GPCR)
Mol. Mass.:52856.55
Organism:Rattus norvegicus (rat)
Description:P20272
Residue:473
BDBM50300771
NameBDBM50300771
Synonyms:CHEMBL570988 | N-(cis-9-cis-12-octadecadienyl)sulfamide
TypeSmall organic molecule
Emp. Form.C18H36N2O2S
Mol. Mass.344.556
SMILESCCCCC\C=C/C\C=C/CCCCCCCCNS(N)(=O)=O