Reaction Details
TargetCannabinoid receptor 1
LigandBDBM50300768
Substrate/Competitorn/a
Meas. Tech.ChEMBL_589972 (CHEMBL1050880)
Ki>100000±n/a nM
Citation Cano, CPáez, JAGoya, PSerrano, APavón, JRodríguez de Fonseca, FSuardíaz, MMartín, MI Synthesis and pharmacological evaluation of sulfamide-based analogues of anandamide. Eur J Med Chem44:4889-95 (2009) 
 
Cannabinoid receptor 1
Name:Cannabinoid receptor 1
Type:G Protein-Coupled Receptor (GPCR)
Mol. Mass.:52856.55
Organism:Rattus norvegicus (rat)
Description:P20272
Residue:473
BDBM50300768
NameBDBM50300768
Synonyms:CHEMBL437157 | N-(1-(1-adamantyl)ethyl)-N'-propylsulfamide
TypeSmall organic molecule
Emp. Form.C15H28N2O2S
Mol. Mass.300.46
SMILESCCCNS(=O)(=O)NC(C)C12CC3CC(CC(C3)C1)C2