Reaction Details
TargetC-X-C chemokine receptor type 3
LigandBDBM50300898
Substrate/Competitorn/a
Meas. Tech.ChEMBL_600877 (CHEMBL1042835)
IC50 1.3±n/a nM
Citation Du, XGustin, DJChen, XDuquette, JMcGee, LRWang, ZEbsworth, KHenne, KLemon, BMa, JMiao, SSabalan, ESullivan, TJTonn, GCollins, TLMedina, JC Imidazo-pyrazine derivatives as potent CXCR3 antagonists. Bioorg Med Chem Lett19:5200-4 (2009) 
 
C-X-C chemokine receptor type 3
Name:C-X-C chemokine receptor type 3
Type:Enzyme Catalytic Domain
Mol. Mass.:40665.65
Organism:Homo sapiens (Human)
Description:n/a
Residue:368
BDBM50300898
NameBDBM50300898
Synonyms:CHEMBL570858 | N-{(R)-1-[3-(4-Cyano-phenyl)-8-cyclopropyl-imidazo[1,2-a]pyrazin-2-yl]-ethyl}-N-(1,1-dioxo-hexahydro-1lambda*6*-thiopyran-4-ylmethyl)-2-(4-trifluoromethyl-phenyl)-acetamide
TypeSmall organic molecule
Emp. Form.C33H32F3N5O3S
Mol. Mass.635.699
SMILESC[C@@H](N(CC1CCS(=O)(=O)CC1)C(=O)Cc1ccc(cc1)C(F)(F)F)c1nc2c(nccn2c1-c1ccc(cc1)C#N)C1CC1