Reaction Details
TargetCannabinoid receptor 1
LigandBDBM50301030
Substrate/Competitorn/a
Meas. Tech.ChEMBL_598161 (CHEMBL1044345)
IC50 1.6±n/a nM
Citation Du, WJewell, JPLin, LSColandrea, VJXiao, JCLao, JShen, CPBateman, TJReddy, VBHa, SNShah, SKFong, TMHale, JJHagmann, WK Synthesis and evaluation of N-[(1S,2S)-3-(4-chlorophenyl)-2-(3-cyanophenyl)-1-methylpropyl]-2-methyl-2-aminopropanamide as human cannabinoid-1 receptor (CB1R) inverse agonists. Bioorg Med Chem Lett19:5195-9 (2009) 
 
Cannabinoid receptor 1
Name:Cannabinoid receptor 1
Type:G Protein-Coupled Receptor (GPCR)
Mol. Mass.:52868.96
Organism:Homo sapiens (Human)
Description:P21554
Residue:472
BDBM50301030
NameBDBM50301030
Synonyms:CHEMBL567679 | N-((2S,3S)-4-(4-chlorophenyl)-3-(3-cyanophenyl)butan-2-yl)-2-methyl-2-(4-(trifluoromethyl)pyridin-2-ylamino)propanamide
TypeSmall organic molecule
Emp. Form.C27H26ClF3N4O
Mol. Mass.514.97
SMILESC[C@H](NC(=O)C(C)(C)Nc1cc(ccn1)C(F)(F)F)[C@@H](Cc1ccc(Cl)cc1)c1cccc(c1)C#N