Reaction Details
TargetMetabotropic glutamate receptor 8
LigandBDBM50301520
Substrate/Competitorn/a
Meas. Tech.ChEMBL_600495 (CHEMBL1046442)
IC50>10000±n/a nM
Citation Satoh, ANagatomi, YHirata, YIto, SSuzuki, GKimura, TMaehara, SHikichi, HSatow, AHata, MOhta, HKawamoto, H Discovery and in vitro and in vivo profiles of 4-fluoro-N-[4-[6-(isopropylamino)pyrimidin-4-yl]-1,3-thiazol-2-yl]-N-methylbenzamide as novel class of an orally active metabotropic glutamate receptor 1 (mGluR1) antagonist. Bioorg Med Chem Lett19:5464-8 (2009) 
 
Metabotropic glutamate receptor 8
Name:Metabotropic glutamate receptor 8
Type:Enzyme Catalytic Domain
Mol. Mass.:101759.58
Organism:Homo sapiens (Human)
Description:metabotropic glutamate 8 GRM8 HUMAN::O00222
Residue:908
BDBM50301520
NameBDBM50301520
Synonyms:4-fluoro-N-(4-(6-(isopropylamino)pyrimidin-4-yl)thiazol-2-yl)-N-methylbenzamide | CHEMBL566581
TypeSmall organic molecule
Emp. Form.C18H18FN5OS
Mol. Mass.371.432
SMILESCC(C)Nc1cc(ncn1)-c1csc(n1)N(C)C(=O)c1ccc(F)cc1