Reaction Details
TargetProthrombin
LigandBDBM50301557
Substrate/Competitorn/a
Meas. Tech.ChEMBL_600518 (CHEMBL1049043)
IC50 42±n/a nM
Citation Hanessian, STherrien, EZhang, JOtterlo, WXue, YGustafsson, DNilsson, IFjellström, O From natural products to achiral drug prototypes: potent thrombin inhibitors based on P2/P3 dihydropyrid-2-one core motifs. Bioorg Med Chem Lett19:5429-32 (2009) 
 
Prothrombin
Name:Prothrombin
Type:Protein
Mol. Mass.:70029.57
Organism:Homo sapiens (Human)
Description:P00734
Residue:622
BDBM50301557
NameBDBM50301557
Synonyms:CHEMBL565291 | N-(4-carbamimidoylbenzyl)-2-(4-methyl-2-oxo-1-(phenylsulfonamido)-1,2,5,6-tetrahydropyridin-3-yl)acetamide
TypeSmall organic molecule
Emp. Form.C22H25N5O4S
Mol. Mass.455.53
SMILESCC1=C(CC(=O)NCc2ccc(cc2)C(N)=N)C(=O)N(CC1)NS(=O)(=O)c1ccccc1