Reaction Details
TargetProthrombin
LigandBDBM50301572
Substrate/Competitorn/a
Meas. Tech.ChEMBL_600518 (CHEMBL1049043)
IC50 3.4±n/a nM
Citation Hanessian, STherrien, EZhang, JOtterlo, WXue, YGustafsson, DNilsson, IFjellström, O From natural products to achiral drug prototypes: potent thrombin inhibitors based on P2/P3 dihydropyrid-2-one core motifs. Bioorg Med Chem Lett19:5429-32 (2009) 
 
Prothrombin
Name:Prothrombin
Type:Protein
Mol. Mass.:70029.57
Organism:Homo sapiens (Human)
Description:P00734
Residue:622
BDBM50301572
NameBDBM50301572
Synonyms:(2S,3aS,7aS)-N-(4-carbamimidoylbenzyl)-1-((R)-3,3-dicyclohexyl-2-((R)-2-hydroxy-3-phenylpropanamido)propanoyl)octahydro-1H-indole-2-carboxamide | CHEMBL567464
TypeSmall organic molecule
Emp. Form.C41H57N5O4
Mol. Mass.683.9224
SMILESNC(=N)c1ccc(CNC(=O)[C@@H]2C[C@@H]3CCCC[C@@H]3N2C(=O)[C@H](NC(=O)[C@H](O)Cc2ccccc2)C(C2CCCCC2)C2CCCCC2)cc1