Reaction Details
TargetProthrombin
LigandBDBM50301573
Substrate/Competitorn/a
Meas. Tech.ChEMBL_600518 (CHEMBL1049043)
IC50 1.6±n/a nM
Citation Hanessian, STherrien, EZhang, JOtterlo, WXue, YGustafsson, DNilsson, IFjellström, O From natural products to achiral drug prototypes: potent thrombin inhibitors based on P2/P3 dihydropyrid-2-one core motifs. Bioorg Med Chem Lett19:5429-32 (2009) 
 
Prothrombin
Name:Prothrombin
Type:Protein
Mol. Mass.:70029.57
Organism:Homo sapiens (Human)
Description:P00734
Residue:622
BDBM50301573
NameBDBM50301573
Synonyms:(2S,3aS,7aS)-N-(4-carbamimidoylbenzyl)-1-((2S,3R)-3-chloro-2-((R)-2-hydroxy-3-phenylpropanamido)-4-methylpentanoyl)octahydro-1H-indole-2-carboxamide | CHEMBL568275
TypeSmall organic molecule
Emp. Form.C32H42ClN5O4
Mol. Mass.596.16
SMILESCC(C)[C@@H](Cl)[C@@H](NC(=O)[C@H](O)Cc1ccccc1)C(=O)N1[C@@H](C[C@@H]2CCCC[C@H]12)C(=O)NCc1ccc(cc1)C(N)=N